{"text_format":"2","workbook":"xlsx","n_sheets":20,"sheets":["0. Wijzingen","1. Inputblad Hoofdaannemer","2. Huisvesting en overig","3. Individuele producten","4. Individuele producten (2)","5. Collectieve ondersteuning","6. Leefbaar & samenredzaam","7. Overzichtsblad","8. Overzichtsblad (2)","9. Verantwoordingsformulier fin","Inputblad","cao's","cao regelingen ort","Onderhoudsblad","Werkbare uren","cao-stijgingen","Uurtarieven per schaal","Subsidiebedragen","Lijsten","Blad1"],"not_rendered":{"charts":0,"images":0,"macros":0,"external_links":0,"defined_names":24,"comments":3,"pivot_tables":0},"unopened":[],"bounds":{"document_bytes":16777216,"sheet_cells":100000,"run_cost":"one","rows_first":2000,"rows_last":500,"rows_between":2000,"halvings":0,"cell_chars":16384,"cell_head_chars":4096},"cells_cut":0,"cells_raw":0,"read":"whole","date_system":"1900"}

{"sheet":"0. Wijzingen","index":0,"n_rows":12,"n_cols":2,"rows_kept":12,"cut":false,"hidden":false,"merged":[]}
[null,"Wijzigingsoverzicht aanvraagformulier Inwonersondersteuning"]
[]
[]
[null,"Versienummer 17 MAART 2020"]
[]
[]
{"$rows_left_out":7}
{"sheet":"1. Inputblad Hoofdaannemer","index":1,"n_rows":34,"n_cols":8,"rows_kept":34,"cut":false,"hidden":false,"merged":[[8,4,8,7],[9,4,9,6],[0,1,0,2],[18,3,18,4],[18,6,18,7],[15,1,15,7],[17,3,17,4],[17,6,17,7],[11,4,11,7],[12,4,12,5],[13,4,13,5],[12,6,12,7],[13,6,13,7],[2,6,2,7],[3,6,3,7],[4,6,4,7],[5,6,5,7],[1,6,1,7]]}
[null,"Subsidieaanvraag Inwonersondersteuning"]
[{"$nulls":6},"grijs en leeg = invullen"]
[null,"Stadsdeel",{"$nulls":4},"wit en leeg = (nog) niet invullen"]
[null,"Subsidiejaar",{"$nulls":4},"geel = formuleberekening"]
[null,"Naam hoofdaannemer",{"$nulls":4},"donkergrijs = nvt"]
[{"$nulls":6},"rood = ongeldige waarde"]
{"$rows_left_out":29}
{"sheet":"2. Huisvesting en overig","index":2,"n_rows":16,"n_cols":8,"rows_kept":16,"cut":false,"hidden":false,"merged":[[2,3,2,5],[3,3,3,5]]}
["Inwonersondersteuning: Huisvesting en overige kosten"]
[]
[null,"kosten",null,"DIT TABBLAD IS NIET INVULBAAR"]
["Huisvestingskosten medewerkers (Samen055 locatie)",27000,null,"Beragen worden automatisch gevuld"]
["Totaal",{"$f":"SUM(B4:B4)","v":27000}]
[]
{"$rows_left_out":11}
{"sheet":"3. Individuele producten","index":3,"n_rows":33,"n_cols":9,"rows_kept":33,"cut":false,"hidden":false,"merged":[[25,5,25,8],[26,5,26,8],[16,1,16,3],[16,4,16,6],[0,7,0,8],[1,7,1,8],[2,7,2,8],[3,7,3,8],[4,7,4,8],[7,1,7,3],[7,4,7,6],[25,1,25,4],[26,1,26,4]]}
[{"$f":"\"Subsidieaanvraag en verantwoording Inwonersondersteuning \"&'1. Inputblad Hoofdaannemer'!C4&\" \"&'1. Inputblad Hoofdaannemer'!C5","v":"Subsidieaanvraag en verantwoording Inwonersondersteuning  "},{"$nulls":6},"grijs en leeg = invullen"]
[{"$nulls":7},"wit en leeg = (nog) niet invullen"]
[{"$nulls":7},"geel = formuleberekening"]
[{"$nulls":7},"donkergrijs = nvt"]
[{"$nulls":7},"rood = ongeldige waarde"]
[]
{"$rows_left_out":28}
{"sheet":"4. Individuele producten (2)","index":4,"n_rows":41,"n_cols":21,"rows_kept":41,"cut":false,"hidden":false,"merged":[[38,1,38,2],[39,1,39,2],[40,1,40,2],[35,1,35,2],[36,1,36,2],[37,1,37,2],[38,3,38,4],[39,3,39,4],[40,3,40,4],[35,5,35,6],[36,5,36,6],[37,5,37,6],[38,5,38,6],[39,5,39,6],[40,5,40,6],[35,3,35,4],[36,3,36,4],[37,3,37,4],[6,1,6,17],[9,1,9,17],[8,1,8,17],[23,1,24,1],[23,2,24,2],[23,8,24,8],[23,3,24,3],[23,7,24,7],[34,1,34,6],[33,1,33,6],[23,4,24,4],[23,5,24,5],[23,6,24,6],[23,20,24,20],[23,15,24,15],[23,16,24,16],[23,17,24,17],[23,9,24,9],[23,10,24,10],[23,11,24,11],[23,12,24,12],[23,13,24,13],[23,14,24,14],[23,18,24,18],[23,19,24,19],[28,18,28,20],[25,1,25,10],[25,11,25,14],[25,18,25,20],[25,15,25,17],[26,1,26,10],[26,11,26,14],[26,18,26,20],[26,15,26,17],[0,12,0,17],[1,12,1,17],[2,12,2,17],[3,12,3,17],[4,12,4,17]]}
[{"$f":"\"Jaarverantwoording Inwonersondersteuning \"&'1. Inputblad Hoofdaannemer'!C4","v":"Jaarverantwoording Inwonersondersteuning "},{"$nulls":11},"grijs en leeg = invullen"]
[{"$nulls":12},"wit en leeg = (nog) niet invullen"]
[{"$nulls":12},"geel = formuleberekening"]
[{"$nulls":12},"donkergrijs = nvt"]
[{"$nulls":12},"rood = ongeldige waarde"]
[]
{"$rows_left_out":30}
{"sheet":"5. Collectieve ondersteuning","index":5,"n_rows":110,"n_cols":33,"rows_kept":110,"cut":false,"hidden":false,"merged":[[0,15,0,19],[78,6,78,23],[109,0,109,3],[3,24,3,32],[39,24,39,27],[39,28,39,29],[39,30,39,32],[40,24,40,32],[76,24,76,27],[76,28,76,29],[76,30,76,32],[77,24,77,32],[76,20,77,20],[76,21,77,21],[76,22,77,22],[76,23,77,23],[72,0,72,3],[76,16,77,16],[76,17,77,17],[76,18,77,18],[76,19,77,19],[41,6,41,23],[76,11,77,11],[76,12,77,12],[76,13,77,13],[76,14,77,14],[76,15,77,15],[76,6,77,6],[76,7,77,7],[76,8,77,8],[76,9,77,9],[76,10,77,10],[39,21,40,21],[39,22,40,22],[39,23,40,23],[39,16,40,16],[39,17,40,17],[39,18,40,18],[39,19,40,19],[39,20,40,20],[2,28,2,29],[2,24,2,27],[2,30,2,32],[39,6,40,6],[39,7,40,7],[39,8,40,8],[39,9,40,9],[39,10,40,10],[39,11,40,11],[39,12,40,12],[39,13,40,13],[39,14,40,14],[39,15,40,15],[2,20,3,20],[2,21,3,21],[2,23,3,23],[2,22,3,22],[2,17,3,17],[4,6,4,23],[2,14,3,14],[2,15,3,15],[2,18,3,18],[2,19,3,19],[2,10,3,10],[2,11,3,11],[2,12,3,12],[2,13,3,13],[2,16,3,16],[35,0,35,3],[2,6,3,6],[2,7,3,7],[2,8,3,8],[2,9,3,9],[3,3,3,4]]}
[{"$f":"\"Collectieve inwonersondersteuning \"&'1. Inputblad Hoofdaannemer'!C4&\" \"&'1. Inputblad Hoofdaannemer'!C5","v":"Collectieve inwonersondersteuning  "},{"$nulls":14},"Alleen grijze cellen invullen",{"$nulls":5},"* Cliëntgebonden uren, dus zonder vakantie, ziekte, niet-cliëntgebonden, etc."]
[{"$nulls":21},"Indien niet genoeg regels voor alle activiteiten neem contact op met Mariëlle Buijse "]
[{"$nulls":6},{"$f":"Lijsten!J2","v":"Financiën"},{"$f":"Lijsten!J3","v":"Werk en opleiding"},{"$f":"Lijsten!J4","v":"Tijdbesteding"},{"$f":"Lijsten!J5","v":"Huisvesting"},{"$f":"Lijsten!J6","v":"Huiselijke relaties"},{"$f":"Lijsten!J7","v":"Geestelijke gezondheid"},{"$f":"Lijsten!J8","v":"Lichamelijke gezondheid"},{"$f":"Lijsten!J9","v":"Middelengebruik"},{"$f":"Lijsten!J10","v":"Basale Activiteiten van het Dagelijks Leven "},{"$f":"Lijsten!J11","v":"Instrumentele Activiteiten van het Dagelijks Leven"},{"$f":"Lijsten!J12","v":"Sociaal netwerk"},{"$f":"Lijsten!J13","v":"Maatschappelijke participatie"},{"$f":"Lijsten!J14","v":"Justitie"},{"$f":"Lijsten!J15","v":"(Ouderschap) Lichamelijke verzorging "},{"$f":"Lijsten!J16","v":"(Ouderschap)\nSociale- emotionele ondersteuning"},{"$f":"Lijsten!J17","v":"(Ouderschap) Scholing "},{"$f":"Lijsten!J18","v":"(Ouderschap) Opvang"},"ANDERS","AANTAL DEELNEMERS NAAR LEEFTIJD",null,null,null,"URENINZET VOOR 1 BIJEENKOMST*",null,"PRODUCTIE (€) ,TOTAAL ALLE BIJEENKOMSTEN"]
[null,null,null,"DATUM OF # PER JAAR",{"$nulls":20},"RAMING 2021"]
[null,"NAAM BIJEENKOMST","TYPE","DATUM","# PER JAAR",null,"BELANGRIJKSTE ONDERWERP BIJEENKOMST (ZRM LEEFGEBIEDEN)",{"$nulls":17},"0-23","24-75","75+","TOTAAL","HBO","MBO","€ HBO","€ MBO","€ Totaal"]
[1,{"$nulls":4},{"$f":"IF(E6=\"\",1,E6)","v":1},{"$nulls":21},{"$f":"SUM(Y6:AA6)","v":0},null,null,{"$f":"AC6*F6*'1. Inputblad Hoofdaannemer'!$G$13","v":0},{"$f":"AD6*F6*'1. Inputblad Hoofdaannemer'!$G$14","v":0},{"$f":"AE6+AF6","v":0}]
{"$rows_left_out":105}
{"sheet":"6. Leefbaar & samenredzaam","index":6,"n_rows":98,"n_cols":10,"rows_kept":98,"cut":false,"hidden":false,"merged":[[70,1,70,9],[2,8,2,9],[3,8,3,9],[38,1,38,9],[1,8,1,9],[6,1,6,9]]}
[{"$f":"\"Inwonersondersteuning: Leefbaarheid & samenredzaamheid \"&'1. Inputblad Hoofdaannemer'!C4&\" \"&'1. Inputblad Hoofdaannemer'!C5","v":"Inwonersondersteuning: Leefbaarheid & samenredzaamheid  "}]
[{"$nulls":8},"grijs en leeg = invullen"]
[{"$nulls":8},"wit en leeg = (nog) niet invullen"]
[{"$nulls":8},"geel = formuleberekening"]
[{"$nulls":4},"* Cliëntgebonden uren, dus zonder vakantie, ziekte, niet-cliëntgebonden, etc."]
[{"$nulls":4},"Indien niet genoeg regels voor alle activiteiten neem contact op met Mariëlle Buijse "]
{"$rows_left_out":93}
{"sheet":"7. Overzichtsblad","index":7,"n_rows":45,"n_cols":20,"rows_kept":45,"cut":false,"hidden":false,"merged":[[36,15,36,17],[10,0,10,5],[10,7,10,12],[24,8,24,9],[1,11,1,13],[1,4,1,6],[1,17,1,19],[10,14,10,19],[35,15,35,17]]}
[{"$f":"\"Aanvraag Inwonersondersteuning hoofdaannemer \"&'1. Inputblad Hoofdaannemer'!C5&\" \"&'1. Inputblad Hoofdaannemer'!C4","v":"Aanvraag Inwonersondersteuning hoofdaannemer  "},{"$nulls":6},{"$f":"\"Halfjaarrapportage hoofdaannemer \"&'1. Inputblad Hoofdaannemer'!C5&\" \"&'1. Inputblad Hoofdaannemer'!C4","v":"Halfjaarrapportage hoofdaannemer  "},{"$nulls":6},{"$f":"\"Jaarrapportage hoofdaannemer \"&'1. Inputblad Hoofdaannemer'!C5&\" \"&'1. Inputblad Hoofdaannemer'!C4","v":"Jaarrapportage hoofdaannemer  "}]
[{"$nulls":4},"alleen grijze velden vullen!",{"$nulls":6},"alleen grijze velden vullen!",{"$nulls":5},"alleen grijze velden vullen!"]
[]
[]
["Te beschikken op functies 2021","Subsidie 2021",{"$nulls":5},"Functie","Realisatie 6/2021",{"$nulls":5},"Functie","Realisatie 2021"]
[{"$f":"'2. Huisvesting en overig'!A12","v":"Coördinatie"},{"$f":"'2. Huisvesting en overig'!H12","v":50812.726793262598},{"$nulls":5},{"$f":"'2. Huisvesting en overig'!A12","v":"Coördinatie"},{"$f":"0.5*B6","v":25406.363396631299},{"$nulls":5},{"$f":"'2. Huisvesting en overig'!A12","v":"Coördinatie"},{"$f":"B6","v":50812.726793262598}]
{"$rows_left_out":40}
{"sheet":"8. Overzichtsblad (2)","index":8,"n_rows":14,"n_cols":18,"rows_kept":14,"cut":false,"hidden":false,"merged":[[5,1,5,17],[6,1,6,17]]}
[{"$f":"\"Verantwoording Inwonersondersteuning \"&'1. Inputblad Hoofdaannemer'!C5&\" \"&'1. Inputblad Hoofdaannemer'!C4","v":"Verantwoording Inwonersondersteuning  "}]
[]
[]
[]
[null,"Financiën","Werk en opleiding","Tijdbesteding","Huisvesting","Huiselijke relaties","Geestelijke gezondheid","Lichamelijke gezondheid","Middelengebruik","Basale Activiteiten van het Dagelijks Leven ","Instrumentele Activiteiten van het Dagelijks Leven","Sociaal netwerk","Maatschappelijke participatie","Justitie","(Ouderschap) Lichamelijke verzorging ","(Ouderschap)\nSociale- emotionele ondersteuning","(Ouderschap) Scholing ","(Ouderschap) Opvang"]
[null,"HOOFDPROBLEEM/THEMA ZRM-LEEFGEBIEDEN CLIËNTEN"]
{"$rows_left_out":9}
{"sheet":"9. Verantwoordingsformulier fin","index":9,"n_rows":31,"n_cols":12,"rows_kept":31,"cut":false,"hidden":false,"merged":[[27,10,27,11],[18,7,18,9],[24,7,24,9],[3,2,3,3],[3,4,3,5],[3,8,3,9],[14,7,14,9],[15,7,15,9],[16,7,16,9],[17,7,17,9],[24,10,24,11],[14,10,14,11],[15,10,15,11],[16,10,16,11],[17,10,17,11],[18,10,18,11],[0,9,0,11],[22,10,22,11],[26,0,26,9],[26,10,26,11],[21,10,21,11],[22,7,22,9]]}
[{"$f":"\"Financiële verantwoording subsidieregeling Algemene Voorzieningen \"&'1. Inputblad Hoofdaannemer'!C4","v":"Financiële verantwoording subsidieregeling Algemene Voorzieningen "},{"$nulls":8},"alleen grijze velden vullen!"]
["* Formulier conform artikel 15 van de \"Algemene subsidieverordening\" en het “Controleprotocol verantwoording en controles van subsidies”"]
[]
[null,null,"geraamde uren",{"$nulls":5},"werkelijke uren"]
[{"$f":"\"Beschikt op producten \"&'1. Inputblad Hoofdaannemer'!$C$4","v":"Beschikt op producten "},"Totaal (€)","hbo","mbo","hbo (€)","mbo (€)",null,"Totaal (€)","hbo","mbo","hbo (€)","mbo (€)"]
[{"$f":"Lijsten!A2","v":"Onafhankelijke cliëntondersteuning"},{"$f":"E6+F6","v":0},{"$f":"'7. Overzichtsblad'!C13","v":0},{"$f":"'7. Overzichtsblad'!D13","v":0},{"$f":"C6*'1. Inputblad Hoofdaannemer'!$G$13","v":0},{"$f":"D6*'1. Inputblad Hoofdaannemer'!$G$14","v":0},null,{"$f":"K6+L6","v":0},{"$f":"'3. Individuele producten'!D10","v":0},{"$f":"'3. Individuele producten'!G10","v":0},{"$f":"I6*'1. Inputblad Hoofdaannemer'!$G$13","v":0},{"$f":"J6*'1. Inputblad Hoofdaannemer'!$G$14","v":0}]
{"$rows_left_out":26}
{"sheet":"Inputblad","index":10,"n_rows":82,"n_cols":11,"rows_kept":82,"cut":false,"hidden":true,"merged":[]}
[]
[null,"TEKST/TOELICHTING"]
[null,"INVULVELD"]
[null,"DOOR FORMULE BEREKENDE WAARDE"]
[]
[]
{"$rows_left_out":77}
{"sheet":"cao's","index":11,"n_rows":22,"n_cols":16,"rows_kept":22,"cut":false,"hidden":true,"merged":[[3,1,3,2],[4,1,4,2],[13,1,15,1],[19,1,21,1]]}
[]
[null,{"$f":"\"Cao-bedragen overgenomen uit officiële cao-salaristabellen\"","v":"Cao-bedragen overgenomen uit officiële cao-salaristabellen"},{"$nulls":9},{"$f":"\"Cao minimum-bedragen bijgewerkt uit officiële cao's\"","v":"Cao minimum-bedragen bijgewerkt uit officiële cao's"}]
[]
[null,"Salaristabel cao",null,{"$f":"Lijsten!F6","v":"VVT"},{"$f":"Lijsten!F4","v":"GGZ"},{"$f":"Lijsten!F5","v":"Gehandicaptenzorg"},null,{"$f":"Lijsten!F3","v":"Jeugdzorg"},{"$f":"Lijsten!F2","v":"Sociaal werk"},null,null,"Minimumbedragen cao"]
[null,"Ingangsdatum cao",null,"2018-10-01","2020-08-01","2019-01-01",null,"2020-01-01","2020-07-01",null,null,"lijstcao","Ingangsdatum","lijsteindvak","eindejaars","vakantiegeld"]
[null,"Opleiding","schaal",null,"max","max","Schaal","max","max",null,null,{"$f":"Lijsten!F2","v":"Sociaal werk"},"2020-07-01","met",{"$f":"12*104.38","v":1252.56},{"$f":"12*174.93","v":2099.16}]
{"$rows_left_out":17}
{"sheet":"cao regelingen ort","index":12,"n_rows":43,"n_cols":27,"rows_kept":43,"cut":false,"hidden":true,"merged":[[26,1,30,1],[32,1,36,1],[38,1,42,1]]}
[]
[null,null,"Tijd","00:00:00","01:00:00","02:00:00","03:00:00","04:00:00","05:00:00","06:00:00","07:00:00","08:00:00","09:00:00","10:00:00","11:00:00","12:00:00","13:00:00","14:00:00","15:00:00","16:00:00","17:00:00","18:00:00","19:00:00","20:00:00","21:00:00","22:00:00","23:00:00"]
[null,"(max uurloon)","Dag","maandag","maandag","maandag","maandag","maandag","maandag","maandag","maandag","maandag","maandag","maandag","maandag","maandag","maandag","maandag","maandag","maandag","maandag","maandag","maandag","maandag","maandag","maandag","maandag"]
[null,{"$f":"2527*12/1878","v":16.146964856230031},{"$f":"Lijsten!$F$2","v":"Sociaal werk"},0.2,0.2,0.2,0.2,0.2,0.2,0.2,{"$nulls":12},0.2,0.2,0.2,0.2,0.2]
[null,{"$f":"2708.43*12/1878","v":17.306261980830669},{"$f":"Lijsten!$F$3","v":"Jeugdzorg"},0.45,0.45,0.45,0.45,0.45,0.45,0.25,{"$nulls":12},0.25,0.25,0.25,0.45,0.45]
[null,{"$f":"2407*12/1878","v":15.380191693290735},{"$f":"Lijsten!$F$4","v":"GGZ"},0.44,0.44,0.44,0.44,0.44,0.44,0.22,{"$nulls":13},0.22,0.22,0.44,0.44]
{"$rows_left_out":38}
{"sheet":"Onderhoudsblad","index":13,"n_rows":35,"n_cols":16,"rows_kept":35,"cut":false,"hidden":true,"merged":[[20,1,23,1],[24,1,27,1],[28,1,31,1],[32,1,34,1],[4,6,4,7],[5,6,5,7],[6,6,6,7],[7,3,7,8],[12,1,15,1],[16,1,19,1]]}
[]
[null,null,null,"Jaar"]
[null,"Voor de tariefbepaling van welk jaar wordt dit bestand gebruikt?",null,2021,{"$nulls":5},"Het model is gebouwd voor de tariefstelling 2019. Bij gebruik in een volgend jaar, vul in voor welk jaar de tarieven worden bepaald."]
[]
[null,null,null,{"$f":"Lijsten!F2","v":"Sociaal werk"},{"$f":"Lijsten!F4","v":"GGZ"},{"$f":"Lijsten!F3","v":"Jeugdzorg"},{"$f":"Lijsten!F5","v":"Gehandicaptenzorg"},null,{"$f":"Lijsten!F6","v":"VVT"}]
[null,"Vanaf welke datum zijn de cao-bedragen van de 'Salaristabel cao' op tabblad 'cao's'?",null,{"$f":"INDEX('cao''s'!$D$4:$I$5,2,MATCH(D5,'cao''s'!$D$4:$I$4,0))","v":"2020-07-01"},{"$f":"INDEX('cao''s'!$D$4:$I$5,2,MATCH(E5,'cao''s'!$D$4:$I$4,0))","v":"2020-08-01"},{"$f":"INDEX('cao''s'!$D$4:$I$5,2,MATCH(F5,'cao''s'!$D$4:$I$4,0))","v":"2020-01-01"},{"$f":"INDEX('cao''s'!$D$4:$I$5,2,MATCH(G5,'cao''s'!$D$4:$I$4,0))","v":"2019-01-01"},null,{"$f":"INDEX('cao''s'!$D$4:$I$5,2,MATCH(I5,'cao''s'!$D$4:$I$4,0))","v":"2018-10-01"},null,"Het model is oorspronkelijk gevuld met salarissen 2018. Neem bij voorkeur uit alle cao's de max bedragen over. Het alternatief is hieronder alleen de loonsverhoging in te vullen. Het model verhoogt de caobedragen dan automatisch. Dat is minder betrouwbaar, soms krijgen bepaalde schalen bijvoorbeeld extra verhogingen."]
{"$rows_left_out":30}
{"sheet":"Werkbare uren","index":14,"n_rows":15,"n_cols":4,"rows_kept":15,"cut":false,"hidden":true,"merged":[[3,1,3,3],[14,1,14,2]]}
[]
[]
[]
[null,"Berekening werkbare uren BG en BH bij fulltime dienstverband"]
[null,"365/7*40","Bruto beschikbaar per jaar",{"$f":"365/7*40","v":2085.7142857142858}]
[null,4,"Arbeidsduurverkorting uren per week",{"$f":"365/7*B6","v":208.57142857142858}]
{"$rows_left_out":10}
{"sheet":"cao-stijgingen","index":15,"n_rows":51,"n_cols":17,"rows_kept":51,"cut":false,"hidden":true,"merged":[[3,1,3,2],[3,11,3,14],[3,15,3,16],[12,1,14,1]]}
[]
[null,{"$f":"\"Berekende effectieve cao-bedragen voor tariefstelling \"&Onderhoudsblad!D3","v":"Berekende effectieve cao-bedragen voor tariefstelling 2021"},{"$nulls":9},{"$f":"\"Berekende cao minimum-bedragen voor tariefstelling \"&Onderhoudsblad!D3","v":"Berekende cao minimum-bedragen voor tariefstelling 2021"}]
[]
[null,"Salaristabel cao",null,{"$f":"Lijsten!F6","v":"VVT"},{"$f":"Lijsten!F4","v":"GGZ"},{"$f":"Lijsten!F5","v":"Gehandicaptenzorg"},null,{"$f":"Lijsten!F3","v":"Jeugdzorg"},{"$f":"Lijsten!F2","v":"Sociaal werk"},null,null,"Minimumbedragen cao",null,null,null,{"$f":"\"Loon- en prijsstijgingen naar prijspeil \"&Onderhoudsblad!D3","v":"Loon- en prijsstijgingen naar prijspeil 2021"}]
[null,"Opleiding","schaal",null,"max","max","Schaal","max","max",null,null,"cao","eindejaars_over_vakantiegeld","eindejaars","vakantiegeld","Loonstijging","Overhead"]
[null,null,{"$f":"'cao''s'!C7","v":"FWG 10"},{"$f":"'cao''s'!D7*INDEX($L$6:$Q$10,MATCH(D$4,$L$6:$L$10,0),MATCH($P$5,$L$5:$Q$5,0))","v":1801.3142069999997},{"$f":"'cao''s'!E7*INDEX($L$6:$Q$10,MATCH(E$4,$L$6:$L$10,0),MATCH($P$5,$L$5:$Q$5,0))","v":2102.2978600000001},{"$f":"'cao''s'!F7*INDEX($L$6:$Q$10,MATCH(F$4,$L$6:$L$10,0),MATCH($P$5,$L$5:$Q$5,0))","v":2122.5077153279999},{"$f":"'cao''s'!G7","v":"schaal 2"},{"$f":"'cao''s'!H7*INDEX($L$6:$Q$10,MATCH(H$4,$L$6:$L$10,0),MATCH($P$5,$L$5:$Q$5,0))","v":2381.2799999999997},{"$f":"'cao''s'!I7*INDEX($L$6:$Q$10,MATCH(I$4,$L$6:$L$10,0),MATCH($P$5,$L$5:$Q$5,0))","v":2463.0749999999998},null,null,{"$f":"Lijsten!F2","v":"Sociaal werk"},"met",{"$f":"'cao''s'!O6*P6","v":1283.8739999999998},{"$f":"'cao''s'!P6*P6","v":2151.6389999999997},{"$f":"1+INDEX(Onderhoudsblad!$D$12:$P$35,MATCH(\"Effectieve loonstijging voor \"&L6&\" t/m \"&Onderhoudsblad!$D$3,Onderhoudsblad!$C$12:$C$35,0),MATCH(Onderhoudsblad!$D$3,YEAR(Onderhoudsblad!$D$12:$P$12),0))","v":1.0249999999999999},{"$f":"1+INDEX(Onderhoudsblad!$D$12:$P$35,MATCH(\"Effectief percentage stijging overhead voor \"&Onderhoudsblad!$D$3,Onderhoudsblad!$C$12:$C$35,0),MATCH(Onderhoudsblad!$D$3,YEAR(Onderhoudsblad!$D$12:$P$12),0))","v":1}]
{"$rows_left_out":46}
{"sheet":"Uurtarieven per schaal","index":16,"n_rows":217,"n_cols":8,"rows_kept":217,"cut":false,"hidden":true,"merged":[]}
[]
[null,{"$f":"\"BEREKENING OP BASIS VAN \"","v":"BEREKENING OP BASIS VAN "}]
[null,{"$f":"UPPER(Inputblad!C8)","v":"SPECIFIEKE CAO'S"}]
[]
[null,"OPLEIDINGSTARIEVEN",{"$f":"'cao-stijgingen'!C25","v":"VVT"},{"$f":"'cao-stijgingen'!D25","v":"GGZ"},{"$f":"'cao-stijgingen'!E25","v":"Gehandicaptenzorg"},{"$f":"'cao-stijgingen'!F25","v":"Jeugdzorg"},{"$f":"'cao-stijgingen'!G25","v":"Sociaal werk"}]
[null,"mbo",{"$f":"SUMPRODUCT(C23:C37,Inputblad!$C$44:$C$58)","v":57.492835886750711},{"$f":"(SUMPRODUCT(D23:D37,Inputblad!$C$44:$C$58))","v":57.731670803264365},{"$f":"(SUMPRODUCT(E23:E37,Inputblad!$C$44:$C$58))","v":56.953972740890137},{"$f":"(SUMPRODUCT(F12:F22,Inputblad!$C$31:$C$41))","v":59.520146560332975},{"$f":"(SUMPRODUCT(G12:G22,Inputblad!$C$31:$C$41))","v":62.868403083383569},{"$f":"AVERAGE(C6:E6)","v":57.392826476968402}]
{"$rows_left_out":212}
{"sheet":"Subsidiebedragen","index":17,"n_rows":0,"n_cols":0,"rows_kept":0,"cut":false,"hidden":true,"merged":[]}

{"sheet":"Lijsten","index":18,"n_rows":97,"n_cols":18,"rows_kept":97,"cut":false,"hidden":true,"merged":[]}
["producten",null,null,null,"schaal","lijstcao","dienst","dag","opleiding","zrm",null,null,null,"korting"]
["Onafhankelijke cliëntondersteuning",1.2916666666666667,"specifieke cao's","mbo","schaal 2","Sociaal werk","Bereikbaarheid","maandag","mbo","Financiën",null,null,{"$f":"J2","v":"Financiën"},"0%",null,null,"Voorlichting","Noordoost"]
["Individuele ondersteuning",1.3020833333333333,"gemiddelde van cao's","mbo","schaal 3","Jeugdzorg","Slaapdienst","dinsdag","hbo","Werk en opleiding",null,null,{"$f":"J3","v":"Werk en opleiding"},0.05,null,null,"Ondersteuning","Noordwest"]
["Waakvlamcontact",1.3125,null,"mbo","schaal 4","GGZ","Wakende dienst","woensdag","wo","Tijdbesteding",null,null,"Tijdbesteding",0.1,null,null,null,"Zuidoost"]
["Informatie en advies",1.3229166666666701,null,"mbo","schaal 5","Gehandicaptenzorg","Reguliere dienst","donderdag",null,"Huisvesting",null,null,"Huisvesting",0.15,null,null,null,"Zuidwest"]
["Collectieve inwondersondersteuning",1.3333333333333299,null,"mbo","schaal 6","VVT",null,"vrijdag",null,"Huiselijke relaties",null,null,"Huiselijke relaties",0.2]
{"$rows_left_out":92}
{"sheet":"Blad1","index":19,"n_rows":23,"n_cols":7,"rows_kept":23,"cut":false,"hidden":true,"merged":[]}
[]
[]
[null,{"$f":"'Uurtarieven per schaal'!B5","v":"OPLEIDINGSTARIEVEN"},{"$f":"'Uurtarieven per schaal'!C5","v":"VVT"},{"$f":"'Uurtarieven per schaal'!D5","v":"GGZ"},{"$f":"'Uurtarieven per schaal'!E5","v":"Gehandicaptenzorg"},{"$f":"'Uurtarieven per schaal'!F5","v":"Jeugdzorg"},{"$f":"'Uurtarieven per schaal'!G5","v":"Sociaal werk"}]
[null,{"$f":"'Uurtarieven per schaal'!B6","v":"mbo"},{"$f":"'Uurtarieven per schaal'!C6","v":57.492835886750711},{"$f":"'Uurtarieven per schaal'!D6","v":57.731670803264365},{"$f":"'Uurtarieven per schaal'!E6","v":56.953972740890137},{"$f":"'Uurtarieven per schaal'!F6","v":59.520146560332975},{"$f":"'Uurtarieven per schaal'!G6","v":62.868403083383569}]
[null,{"$f":"'Uurtarieven per schaal'!B7","v":"hbo"},{"$f":"'Uurtarieven per schaal'!C7","v":68.419265119272723},{"$f":"'Uurtarieven per schaal'!D7","v":67.822473308940289},{"$f":"'Uurtarieven per schaal'!E7","v":67.487622520889957},{"$f":"'Uurtarieven per schaal'!F7","v":68.445432801924412},{"$f":"'Uurtarieven per schaal'!G7","v":73.089301366848218}]
[]
{"$rows_left_out":17}